Ontology
comment: PROTON (Proto Ontology), Upper module
version info: 0.2
imports: protons.owl
imports: protont.owl

Accident
type: Class
subclass of: Event

Account
type: Class
comment: An explicit agreement between agents. Typically, service providers (e.g. banks or ISPs) provide accounts to their customers or users, which are considered account owners. The existence of the account depends on the provider, even though the user owns it in some metaphoric sense. Examples could be bank, ISP, e-Commerce, ICQ, email accounts. The accounts are usually aligned with a sort of contract.
subclass of: Object

Address
type: Class
comment: Any sort of address, specifying how to locate something somewhere
subclass of: ContactInformation

Airline
type: Class
subclass of: Company

Airplane Model
type: Class
subclass of: ProductModel

Airport
type: Class
comment: An airport, including heliports. NIMA GNS designators AIPR, AIRH.
subclass of: Transport Facility

Album
type: Class
subclass of: Audio Recording

Alcoholic Beverage
type: Class
comment: A type (specific receipe) for a beverage. For instance: Guiness Beer, Absolut Currant, etc.
subclass of: Beverage

Amusement Park
type: Class
comment: (ADL FT) Commercially operated enterprises that offer rides, games, and other forms of entertainment. NIMA GNS designator - no equivalents.
subclass of: Recreational Facility

Announcement
type: Class
comment: A formal public statement; "the government made an announcement about changes in the drug war"; "a declaration of independence".) WordNet 1.7.1
subclass of: Published Material

Archipelago
type: Class
comment: (ADL FT) Seas or areas in a sea that contain numerous islands; also, the island groups themselves. NIMA GNS designator - no equivalent.
subclass of: Island
subclass of: Water Region

Art
type: Class
subclass of: Social Abstraction

Art Performance
type: Class
comment: A specific performance taking place at some moment, somewhere. Quite often starting at 19:00 in the theatre, stadium, etc.
subclass of: Event

Article
type: Class
comment: A relatively short document publishes as a part of Resource Collection.
subclass of: Published Material

Artificial Satellite
type: Class
comment: A satellite created by humans
subclass of: Facility

Astronomical Object
type: Class
comment: Any object studied by astronomers, (usually quite large natural and inanimate) object that is located in the physical universe and is not on the surface of the Earth. Definition partly derived from OpenCyc 0.7
subclass of: Location

Audio Recording
type: Class
subclass of: Musical Composition

Acquirement
type: Class
comment: The event of the acquiring of one organization by another.
subclass of: Event

Bank
type: Class
subclass of: Company

Bay
type: Class
comment: (ADL FT) Indentations of a coastline or shoreline enclosing a part of a body of water; bodies of water partly surrounded by land. We use this category for bahias; for coves; and for embayments. NIMA GNS designators BAY, BAYS.
subclass of: Water Region

Beach
type: Class
comment: (ADL FT) Sloping shores along a body of water that is washed by waves or tides and is usually covered by sand or gravel. ... We use this category for sandy areas; and for strands. NIMA GNS designator BCH, BCHS.
subclass of: Land Region

Beverage
type: Class
comment: Any liquid suitable for drinking (WordNet, 1.7). The instances of this class are types of drinks, specific receipts. For instance: Diet Coke, Bacardi Spice.
subclass of: Chemical Compound

Biogeographic Region
type: Class
comment: (ADL FT) Geographic regions characterized chiefly by the dominant forms of plant life and the prevailing climate. [Adapted from American Heritage Dict. of the English Language, 4th ed.] We use this category for biomes; for ecoregions; and for vegetation. Omitted ADL sub-classes: Barren lands, Grasslands, Habitats, Snow Regions, Wetlands. NIMA GNS designator - no equivalent. Some correspondence to class Hypsographic Features.
subclass of: Land Region

Board Meeting
type: Class
subclass of: Meeting

Board Member
type: Class
comment: Position of a Person who belongs to the Board of Directors, which is responsible for oversight of the Organization. A member of the Board of Directors of an organization may or may not be an executive of the organization.
subclass of: JobPosition

Book
type: Class
comment: A relatively large published document. It may or may not have chapters. There could be series of books considered as volumes of a single one.
subclass of: Published Material

Brand
type: Class
comment: Like Dodge and Milka
subclass of: Object

Bridge
type: Class
comment: (ADL FT) Structures erected over a depression or obstacle to carry traffic. [USGS Circ 1048] We use this category for covered bridges; for drawbridges; for overpasses; for trestles; and for viaducts. NIMA GNS designator BDG, BDGQ.
subclass of: Transport Facility

Building
type: Class
comment: (ADL FT) Permanent constructions that are roofed and usually walled. [USGS Circ 1048] We use this category for administrative facilities; for administrative facilities; for animal pounds; for animal shelters; for aquariums; for barns; for border posts; for cabins; for castles; for city halls; for civic centers; for civil buildings; for club houses; for coast guard stations; for commissaries; for community centers; for community houses; for conference facilities; for consulates; for convention centers; for customs houses; for customs posts; for depots; for embassy buildings; for exhibition buildings; for facilities; for facility centers; for fire stations; for firehouses; for forest stations; for government buildings; for guard stations; for halls; for headquarters; for hostels; for hotels; for houses; for inns; for inspection stations; for legation buildings; for lodges; for missions; for motels; for neighborhood centers; for offices; for park headquarters; for patrol posts; for pavilions; for planetariums; for plazas; for police posts; for public buildings; for ranger stations; for restaurants; for shelters; for shops; for stations; for structures; for student unions; for studios; for substations; for taverns; for town halls; for trading posts; for treatment plants; for United States Government establishments; for visitor centers; for walls; and for warehouses NIMA GNS designator BLDG.
subclass of: Facility

Business Abstraction
type: Class
subclass of: Abstract

CEO
type: Class
subclass of: Executive

Calendar Month
type: Class
comment: A specific month of the year, such as: Jan., Feb., etc.
subclass of: Temporal Abstraction

Calendar Year
type: Class
comment: A specific year, such as 2000, taken as a time interval
subclass of: TimeInterval

Camp
type: Class
comment: (ADL FT) Designated areas on which primitive structure(s) are erected for temporary shelter or where recreational vehicles are temporarily parked. [USGS Circ 1048] We use this category for campgrounds; for camping sites; for logging camps; for oil camps; for refugee camps; for RV parks; and for trailer parks (recreational). NIMA GNS designators CMP, CMPL, CMPLA, CMPO, CMPQ, CMPRF.
subclass of: Recreational Facility

Canal
type: Class
comment: (ADL FT) Artificial waterways with no flow or a controlled flow used for navigation (canal), or for draining or irrigating land (ditch). We use this category for canal bends; for canalized streams; for ditch mouths; for ditches; for drainage canals; for drainage ditches; for drains (channels); for flumes (manmade); for irrigation canals; for irrigation ditches; for irrigation systems; for laterals; for navigation canals; and for underground irrigation canals. NIMA GNS designators CNL,CNLA, CNLB, CNLD, CNLI, CNLN, CNLQ, CNLSB, CNLX.
subclass of: Channel
subclass of: Hydrographic Structure

Canyon
type: Class
comment: (ADL FT) Relatively narrow, deep depressions with steep sides, the bottom of which generally has a continuous slope ... We use this category for barrancas; for chasms; for flumes (natural); for gorges; for gulches; for quebradas; and for ravines. NIMA GNS designator CNSU, CNYN, CNYU, GRGE, RAVU, RVN.
subclass of: Valley

Cape
type: Class
comment: (ADL FT) Projection of land extending into a body of water that prominently marks a change in or interrupts the coastal trend of that water body. We use this category for headlands; for peninsulas; for points (physiographic); and for promontories. NIMA GNS designator CAPE, HDLD, PROM.
subclass of: Land Region

Capital
type: Class
comment: (ADL FT) Towns or cities that are the official seats of government in a political entity, such as a state or nation. [American Heritage Dic. of the English Language, 4th ed.] We use this category for county seats; for national capitals; and for state capitals. NIMA GNS designators PPLC, PPLA
subclass of: City

Car Model
type: Class
comment: Such as Ford-T or BMW Z3.
subclass of: ProductModel

Cave
type: Class
comment: (ADL FT) Natural underground passageways or chambers, or hollowed out cavities in the side of a cliff. ... We use this category for cave entrances; for caverns; for grottoes; for natural tunnels; and for underground lakes. NIMA GNS designator CAVE.
subclass of: Land Region

Chairman
type: Class
subclass of: Leader

Channel
type: Class
comment: (ADL FT) (a) Relatively narrow seas or stretches of water between two close landmasses and connecting two larger bodies of water; (b) Deeper parts of a moving body of water (as bays, estuaries, or straits) through which the main current flows or which affords the best passage through an area otherwise too shallow to navigate. ... We use this category for chutes (hydrographic); for cutoffs (hydrographic); for inlets; for lake channels; for marine channels; for narrows (hydrographic); for navigation channels; for reaches (hydrographic); for sounds (bodies of water); and for straits. NIMA GNS designators CHN, CHNL, CHNM, CHNN, STRT.
subclass of: Water Region

Charity
type: Class
comment: A legal charity organization
subclass of: Organization

Chemical Compound
type: Class
comment: A specific chemical compound, such as H2O or Zarin.
subclass of: ProductModel

City
type: Class
comment: (ADL FT) For smaller, less formally established communities, use 'populated places'. For independent cities, use 'countries, 2nd order divisions. Incorporated populated places. [Adapted from USGS Circ 1048] We use this category for municipalities; for towns; and for urban areas. NIMA GNS designator PPL.
subclass of: Populated Place

Coast
type: Class
comment: (ADL FT: Coastal Zones) Strips of land (of indefinite width) that extend from the low-tide line inland to the first major change in landform features. [Adapted from Glossary of Geology, 4th ed.] We use this category for coastal plains; for coasts; for intertidal zones; for offshore areas; for shorelines; and for shores. NIMA GNS designators CST, SHOR.
subclass of: Land Region

Commercial Organization
type: Class
comment: Organization which buys or sells goods or services for a profit. It may also be a Business or it may merely be a sub-organization of a Business entity.
subclass of: Organization

Company
type: Class
comment: A private, legal, corporate entity with the legal rights to own property, manage itself, and sue or be sued. It is established by a charter or registration granted by the government.
subclass of: Commercial Organization

Concert
type: Class
subclass of: Art Performance

Continent
type: Class
comment: (ADL FT) Earth's major land masses, including both dry land and continental shelves. NIMA GNS designator - no equivalent.
subclass of: Land Region

Contract
type: Class
comment: Any sort of contract or treaty, as well, as other documents signed or otherwise accepted by more than one agent.
subclass of: Document

Country
type: Class
comment: (ADL FTT) Territory occupied by a large group of people organized under a single, usually independent government, and recognized internationally as a country. [Adapted from American Heritage Dic. of the English Language, 4th ed.] We use this category for nations; and for republics. NIMA GNS designators PCLD, PCLF, PCLI, PCLS. FIPS 10-4 is applicable, difining: Basic geopolitical entities assigned country codes include the following categories: (a) independent states; (b) dependent areas; (c) areas of quasi-independence, non-contiguous territories, possessions without populations, areas with special sovereignty associations, areas without sovereignty; (d) political regimes not recognized by the United States; and (e) outlying areas of the United States. The list of basic entities provides complete coverage of the land areas of the world without overlap or duplication.
subclass of: Political Region

Country Capital
type: Class
comment: A capital of a Country. NIMA GNS designator PPLC.
subclass of: Capital

County
type: Class
comment: (ADL FT: Countries, 2nd order divisions) Second-order divisions of a nation such as parishes, boroughs, counties, municipios, or judicial divisions, and independent cities such as those in Maryland, Missouri, Nevada, and Virginia. [Adapted from USGS Circ 1048] We use this category for boroughs; for counties; for judicial divisions; for municipios; for parishes; and for second-order administrative divisions. NIMA GNS designator ADM2.
subclass of: Political Region

Crater
type: Class
comment: (ADL FT) Circular-shaped depressions at the summit of a volcanic core or on the surface of the land caused by the impact of a meteorite; man-made depressions caused by an explosion. ... We use this category for calderas. NIMA GNS designator CRTR, CLDA.
subclass of: Land Region

Creek
type: Class
comment: (ADL FT: Guts) Relatively small coastal waterways connecting larger bodies of water or other waterways. NIMA GNS designator CRKT, INLT.
subclass of: Water Region

Currency
type: Class
comment: Specific currency, usually national
subclass of: Object

Data Schema
type: Class
comment: A particular notation for representation, standardization, and/or structuring of infomation. It can range from db schema, through ontology, to any sort of taxonomies, nomenclatures and subject hierarchies. Examples are Dublin Core, KIMO, SIC, XML, RDFS
subclass of: InformationResource

Dataset
type: Class
comment: A dataset is information encoded in a defined structure (for example, lists, tables, and databases), intended to be useful for direct machine processing (DCMI Type.) Somehow structured and interrelated body of information, data, or knowledge. This includes databases, knowledge bases, catalogues, registries, specific lists, etc. All tangible aspects (like media or host) are irrelevant for this class - it only considers the abstract information. What can be considered as a single document is outside the scope of this class, although it can be comprehensive in terms of size and structure.
subclass of: InformationResource

Date
type: Class
comment: A specific date, as 12th of April, 1956, as the time period (the 24 hours of the day)
subclass of: TimeInterval

Day of Month
type: Class
subclass of: Temporal Abstraction

Day of Week
type: Class
comment: (day)
subclass of: Temporal Abstraction

Daytime
type: Class
comment: Specific time (point) during the day, when the day is not specified. Like in "the supermarket is closing 20:30 p.m."
subclass of: Temporal Abstraction

Delta
type: Class
comment: (ADL FT) Flat plains formed by alluvial deposits at the mouth of a stream. NIMA GNS designator DLTA.
subclass of: Land Region

Desert
type: Class
comment: (ADL FT) Regions rendered barren or partially barren by environmental extremes, especially by low rainfall. [USGS Circ 1048] We use this category for arid regions; for bajadas; for rock deserts; for sandy areas; for sandy deserts; and for stony deserts. NIMA GNS designators DSRT, ERG, HMDA, REG.
subclass of: Biogeographic Region

Disease
type: Class
comment: A specific sort of desease, such as AIDS, SARS, Parcinson, etc. The instances of those class can often by considered as terms instead of entities, but in all cases, those are the general phenomena, not the particular situations when somebody is suffering the disease.
subclass of: Natural Phenomenon

Division
type: Class
comment: Branch, division, department, laboratory, etc. within an organisation. Usually, not a legal agent and not independent.
subclass of: Organization

Drug
type: Class
comment: Such as Viagra.
subclass of: Chemical Compound

E-mail
type: Class
subclass of: Internet Address

Educational Organization
type: Class
subclass of: Organization

Employee
type: Class
subclass of: JobPosition

Executive
type: Class
comment: An executive managerial position in a certain Organization. Executives are top managers of organizations, including corporate officers (CompanyPresident, etc.), Chiefs of Staff, Generals, Admirals, and others like Chief Corporate Counsel, Managing Partner, Producer, Chief Scientist, Chief Engineer, as well as other top and middle-top managers.
subclass of: Leader
subclass of: Manager

Facility
type: Class
comment: (ADL FT: Manmade Features, no def) Any regions and locations determined artificially, as a result of human activity. Many of the ADL sub-classes are omitted. NIMA GNS - no direct equivalent, although many sub-types are defined as classes (S, R) and designators.
subclass of: Location

Festival
type: Class
comment: Any widely recognized festival or holiday, such as, Christmas or St. Valentine's Day
subclass of: Temporal Abstraction

Fjord
type: Class
comment: (ADL FT) Long narrow glacially-eroded inlets of the sea, U-shaped and steep-walled, generally several hundred meters deep, between high rocky cliffs or slopes along a mountainous coast. ... We use this category for fiords; and for lochs. NIMA GNS designator FJD, FJDS.
subclass of: Bay

Forest
type: Class
comment: (ADL FT) Dense growths of trees, plants, and underbrush covering a large area. [American Heritage Dic. of the English Language, 4th ed.] We use this category for forest reserves; and for national forests. Omitted ADL sub-classes: Petrified forests, Rain forests, Woods (the sub-classes collapsed here). NIMA GNS designator FRST, FRSTF, GDVC, GRVO, GRVP, GRVPN, TREE.
subclass of: Biogeographic Region

Galaxy
type: Class
subclass of: Astronomical Object

Gap
type: Class
comment: (ADL FT) Ravines or gorges cut deeply through mountain ridges, or between hills or mountains. We use this category for cols; for defiles; for passes; for saddles (physiographic); and for sills (physiographic). NIMA GNS designator GAP, GAPU, GAPF, PASS, SILL, SILU.
subclass of: Land Region

Global Region
type: Class
comment: Things like Southeastern Europe, Middle East, Oceania are global regions
subclass of: Location

Government
type: Class
comment: The governmental cabinet
subclass of: Government Organization

Government Organization
type: Class
comment: The government of a country, i.e. the authorized country administration, without account for a specific government elected and being in power for some period. This notion of government groups all the administration, including any sort of ministries, agencies, commissions, etc.
subclass of: Organization

Gulf
type: Class
comment: (ADL FT) Largest of various forms of inlets of the sea; usually larger, more enclosed, and more deeply indented than bays. NIMA GNS designator GULF.
subclass of: Water Region

Harbor
type: Class
comment: (ADL FT) Sheltered areas of water where ships or other watercraft can anchor or dock. We use this category for anchorages; for anclajes; for boat yards; for boatyards; for dock yards; for docking basins; for dockyards; for dry docks; for harbors; for marine terminals; for moorings; for ports; for roadsteads (anchorages); and for turning basins. The following sub-classes included (i.e. not-distinguishable): Marinas, Piers. NIMA GNS designators HBR, HBRX, MAR, BTYD, PIER, DCK, DCKB, DCKY, PRT, AIRS.
subclass of: Hydrographic Structure
subclass of: Water Region

Homepage
type: Class
subclass of: Web Page

Hotel
type: Class
subclass of: Building

Hydrographic Structure
type: Class
comment: (ADL FT) For constructed bodies of water. For natural water bodies, use 'hydrographic features'. We use this category for boat landings; for boat launches; for boat ramps; for sluices; and for water mills. Many sub-classes omitted; those considered are also made sub-classes of WaterRegion. NIMA GNS ... no direct equivalent.
subclass of: Facility

IP Address
type: Class
subclass of: Internet Address

Industry Sector
type: Class
subclass of: Business Abstraction

Institute
type: Class
subclass of: Research Organization

Insurance Company
type: Class
subclass of: Company

International Organization
type: Class
comment: Legal international organization. Legal in this case means officially recognized by more than one government.
subclass of: Organization

Internet Address
type: Class
subclass of: ContactInformation

Internet Domain
type: Class
subclass of: Internet Address

Island
type: Class
comment: (ADL FT) Tracts of land smaller than a continent, surrounded by the water of an ocean, sea, lake or stream. [Glossary of Geology, 4th ed.] We use this category for atolls; for cays; for island arcs; for isles; for islets; for keys (islands); for land-tied islands; and for mangrove islands. NIMA GNS designator ISL, ISLF, ISLM, ISLS, ISLT, ISLX
subclass of: Land Region

Issue of Periodical
type: Class
comment: A specific issue, number, and/or volume of periodical publication such as magazine.
subclass of: Published Material

Isthmus
type: Class
comment: (ADL FT) Narrow sections of land in a body of water connecting two larger land areas. NIMA GNS designator ISTH.
subclass of: Land Region

Jungle
type: Class
comment: (ADL FT) Tropical regions of wild, tangled, dense vegetation. NIMA GNS designator - no equivalent.
subclass of: Biogeographic Region

Lake
type: Class
comment: (ADL FT) Use 'reservoirs' for human engineered lakes. Natural inland bodies of standing water, generally of appreciable size, occupying a depression in the Earth's surface. [Adapted from Glossary of Geology, 4th ed.] We use this category for beaver ponds; for crater lakes; for dry lakes; for fish ponds; for fishponds; for inland seas; for intermittent lakes; for intermittent oxbow lakes; for intermittent ponds; for intermittent pools; for intermittent salt lakes; for intermittent salt ponds; for lagoons; for laguna; for lake beds; for lochs; for millponds; for oxbow lakes; for ponds; for pools (water bodies); for salt evaporation ponds; for salt lakes; for salt ponds; and for tarns. NIMA GNS designators LBED, LK, LKC, LKI, LKN, LKNI, LKO, LKOI, LKS, LKSB, LKSC, LKSI, LKSN, LKSNI, LKX
subclass of: Water Region

Land Region
type: Class
comment: Any sort of land regions which are sort of natural, i.e. excluding urban areas, political and administrative regions. It combines number of ADL feature types under Physiographic features and Regions. Omitted ADL sub-classes: Badlands, Bars, Basins, Bight, Cirques, Cliffs, Dunes, Flats, Karst areas. Ledges, Massifs, Mineral deposit areas, Moraines, Natural rock formations, Arches, Playas, Seafloor Features, Tectonic features, Volcanic features (Volcano put under Mountain), Subcontinents. NIMA GNS designators FSR, FURU, HMCK, PLDR, RKFL, SINK, SLID, SLP, SLPU, TERU, TRR.
subclass of: Location

Launch Facility
type: Class
comment: (ADL FT) Areas from which rockets/missiles may be housed and projected, usually equipped with associated buildings and facilities. [USGS Circ 1048] We use this category for missile sites. NIMA GNS designator - no equivalent.
subclass of: Transport Facility

Leader
type: Class
comment: A position for a person who heads an Organization. Typically, a leader of an organization makes major decisions on behalf of the whole organization, has the authority to direct the organization's personnel to carry out those decisions, and is empowered to engage or negotiate with external agents to achieve the organization's goals. This collection includes leaders of Divisions, such as department heads within larger organizations. Also, a single person may be a leader in more than one organization.
subclass of: JobPosition

Legislation
type: Class
comment: Various sorts of legislative documents, including consitutions, laws, etc.
subclass of: InformationResource

Local Capital
type: Class
comment: A capital of a Province or smaller administrative region. NIMA GNS designator PPLA.
subclass of: Capital

Lock
type: Class
comment: (ADL FT) Stretches of water in canals, streams, or docks, enclosed by gates at each end, and used in raising and lowering boats as they pass from one water level to another. NIMA GNS designator LOCK.
subclass of: Hydrographic Structure
subclass of: Transport Facility

Magazine
type: Class
comment: A periodic paperback publication; "it takes several years before a magazine starts to break even or make money"), WordNet 1.7.1. This includes also journals and digests. The specific issues typically contain number of different articles.
subclass of: Periodical Publication

Magazine Issue
type: Class
comment: A specific issue of a magazine, journal or digest.
subclass of: Issue of Periodical
subclass of: Resource Collection

Man
type: Class
subclass of: Person

Manager
type: Class
comment: Person whose primary job is to manage other people, directing their work activity in an Organization or for a project. A Manager tells his or her subordinate workers what to do
subclass of: Employee

Market
type: Class
comment: In contrast to IndustrySector, the market is determined by the customers instead of the business or the manifacturers. The market can be defined in terms of types of goods/services, geographic region, price levels and typical customer behaviours. Corresponding to the third sense in WordNet 1.7.1 "the customers for a particular product or service".
subclass of: Business Abstraction

Media Brand
type: Class
subclass of: Brand

Media Company
type: Class
subclass of: Company

Media Product
type: Class
comment: A mass media product (for instance a newspaper) abstracted from its organizational and ownership aspects (i.e. from its publisher) and considered more as a social phenomenon, partly a brand.
subclass of: ProductModel

Meeting
type: Class
subclass of: Event

Meeting Proceedings
type: Class
comment: A collection of articles or presentations published as a book.
subclass of: Book
subclass of: Resource Collection

Member of Parliament
type: Class
subclass of: JobPosition

Message
type: Class
comment: A written message, including various postings in newspapers or public sources, job position adverts, etc.
subclass of: Document

Military Areas
type: Class
comment: (ADL FTT) We use this category for air force bases; for army facilities; for arsenals; for artillery ranges; for barracks; for bases (military); for camps (military); for forts; for infantry camps; for maneuver areas; for military bases; for military installations; for national guard facilities; and for naval bases. The following NIMA designators fit here: MILB, INSM, SCHM. The following ADL types are skipped as irrelevant: Cadastral areas,
subclass of: Political Region

Military Conflict
type: Class
subclass of: Event

Mine Site
type: Class
comment: (ADL FT) Places or areas from which commercial minerals are or were removed by excavation from the Earth. [Adapted from USGS Feature Class Definitions <http://mapping.usgs.gov/www/ti/GNIS/gnis_users_guide_appendixc.html>] We use this category for adits (mine sites); for chrome mines; for coal mines; for collieries; for copper mines; for diatomite mines; for gold mines; for gravel pits; for iron mines; for lead mines; for mine entrances; for mine shafts; for mines; for mining areas; for mining camps; for nickel mines; for open pit mines; for placer mines; for quarries; for salt mines; for strip mines; and for tin mines. NIMA GNS designators MN, MNA, MNAU, MNC, MNCR, MNDT, MNFE, MNN, MNNI, MNPB, MNPL. MNQ, MNSN.
subclass of: Facility

Minister
type: Class
subclass of: Executive

Ministry
type: Class
comment: (Department) A specific ministry or department, structural unit of the government of specific country with focus and authority on specific problems of the country.
subclass of: Government Organization

Money
type: Class
comment: A specific amount of money in specific currency
subclass of: Social Abstraction

Month
type: Class
comment: A specific month, like Dec 2000, as a time period.
subclass of: TimeInterval

Monument
type: Class
comment: (ADL FT) Structures erected as memorials. [Adapted from American Heritage Dic. of the English Language, 4th ed.] We use this category for cairns; for landmarks (monuments); for memorials; for national monuments; for pyramids; for shrines; for statues; and for tombs. NIMA GNS designators MNMT, PYR, PYRS, CARN.
subclass of: Facility

Mountain
type: Class
comment: (ADL FT) Landmasses that project conspicuously above their surroundings. [USGS Circ 1048] We use this category for cerros; for cordilleras; for foothills; for hills; for knolls; for mounds; and for mounts. Omitted ADL sub-classes: Continental divides. NIMA GNS designator MT, MTS, MTSU, MTU, MND, KNLU, KNSU, CDAU, HLL, HLLS, HLLU, HLSU.
subclass of: Land Region

Mountain Range
type: Class
comment: (ADL FT) (a) Chains of hills or mountains; (b) somewhat linear, complex mountainous or hilly areas. ... We use this category for ranges (physiographic); and for sierra. NIMA GNS designator RNGU.
subclass of: Mountain

Mountain Summit
type: Class
comment: (ADL FT) Peaks of mountains. [USGS Circ 1048] We use this category for ahus; for mountain crests; for nunataks; for peaks; and for summits. NIMA GNS designators PK, PKS, PKSU, PKU.
subclass of: Mountain

Movie
type: Class
subclass of: Media Product

Musical Composition
type: Class
subclass of: Media Product

Natural Phenomenon
type: Class
comment: Such as particular disease, the Gulfstream and other similar natural abstractions. The particular events or objects which could instantiate an abstract natural phenomena (i.e. specific sickness event caused by a disease) are not instances of this class.
subclass of: Abstract

Natural Satellite
type: Class
comment: A satellite which is not a direct result of human activity
subclass of: Satellite

News Agency
type: Class
subclass of: Media Company

Newspaper
type: Class
comment: A newspaper abstracted from its organizational and ownership aspects as well as from specific issue or paper body.
subclass of: Periodical Publication

Newspaper Issue
type: Class
subclass of: Issue of Periodical
subclass of: Resource Collection

Non-geographic Location
type: Class
comment: A non-geographic region in some 3D space. The Longitude and Latitude properties for such objects could be void.
subclass of: Location

Oasis
type: Class
comment: (ADL FT) Fertile, vegetated areas in the midst of a desert, where the water table has come close enough to the surface for wells and springs or seepages to exist, thus making them suitable for human habitation. NIMA GNS designator OAS.
subclass of: Biogeographic Region

Ocean
type: Class
comment: (ADL FT) Continuous salt-water bodies that surround the continents and fill the Earth's great depressions. NIMA GNS designator OCN
subclass of: Sea

Offer
type: Class
comment: Something offered (as a proposal or bid), WordNet 1.7.1. An offer is a statement made by the offerer to a specific agent or without recepient.
subclass of: Statement

Official Political Meeting
type: Class
subclass of: Meeting

Official Position
type: Class
comment: Specific position, which models the Person->hasPosition->Location, e.g. "the president of US", "the Mayor of NY". It is usually a shortcut to holding a position within the local government or other local administration, including military positions.
subclass of: JobPosition

Oil Field
type: Class
comment: (ADL FT) Areas with reserves of recoverable petroleum or where petroleum has been removed from the Earth. ... We use this category for gas fields; for gasfields; for oilfields; for petroleum fields; and for storage fields (petroleum). NIMA GNS designator CMPO, OILF, OILQ, OILW, PMPO, GASF.
subclass of: Facility

Olympic Games
type: Class
comment: a specific issue of the games, like Athens 2004
subclass of: Sport Event

Opera Performance
type: Class
subclass of: Art Performance

Order
type: Class
subclass of: Statement

Park
type: Class
comment: (ADL FT) Places or areas developed for public use or recreation. [USGS Circ 1048] We use this category for arboretums; for botanical gardens; for commemorative areas; for commons; for gardens; for marine parks; for national forests; for national parks; for national seashores; for park gates; for picnic areas; for playgrounds; for provincial parks; for public use areas; for recreation areas; for rest areas; for scenic areas; for state forests; for state parks; for urban parks; for village squares; for wilderness areas; for zoological gardens; and for zoos. Omitted sub-classes: Viewing locations. NIMA GNS designators PRK, PRKHQ, PRKGT
subclass of: Facility

Parliament
type: Class
comment: A legislative assembly representative at national or regional level. It can also be called Senate, etc.
subclass of: Political Entity

Patent
type: Class
comment: A registered (or awaiting registration) patent for specific invention or design.
subclass of: InformationResource

Peninsula
type: Class
comment: NIMA GNS designator PEN, PENX.
subclass of: Land Region

Percent
type: Class
comment: A specific percent value
subclass of: Number

Performance Site
type: Class
comment: Buildings where cultural events are presented before an audience. We use this category for amphitheaters; for amphitheatres; for auditoriums; for bowls (performance); for coliseums; for concert halls; for opera houses; for playhouses; for recital halls; for stages (performance); for symphony halls; for theaters; and for theatres. NIMA GNS designator AMTH.
subclass of: Building
subclass of: Recreational Facility

Periodical Publication
type: Class
comment: A periodical publication, disregarding its specific issues, numbers, volumes, etc.
subclass of: Media Brand

Phone Number
type: Class
subclass of: ContactInformation

Piece of Art
type: Class
comment: An artifact, namely a piece of art, usually, matterial object. Typical instances are paintings and sculptures. Corresponds to the Wordnet 1.7.1 synset "art, fine art - the products of human creativity; works of art collectively; "an art exhibition"; "a fine collection of art")"
subclass of: Object

Pipeline
type: Class
comment: (ADL FT) Tubular conduits of substantial length, with pumps, valves, and control devices, for conveying fluids, gases, or finely divided solids. [USGS Circ 1048] We use this category for compressor stations; for gas pipelines; for oil pipeline junctions; for oil pipeline terminals; for oil pipelines; for oil pumping stations; for pump houses; for pumphouses; for pumping stations; and for water pumping stations. NIMA GNS designators OILP, OILJ, TRMO, PMPO, PMPW.
subclass of: Transport Facility

Plain
type: Class
comment: (ADL FT) Regions of general uniform slope, comparatively level and of considerable extent. [USGS Circ 1048] We use this category for interfluves; and for llanos. NIMA GNS designators PLN, PLNU, PLNX, INTF.
subclass of: Land Region

Planet
type: Class
comment: Any of the celestial bodies (other than comets or satellites) that revolve around the sun in the solar system. Definition partly derived from WordNet 1.7
subclass of: Astronomical Object

Plateau
type: Class
comment: (ADL FT) Comparatively flat areas of great extent and elevation; specif. extensive land regions considerably above the adjacent country or above sea level; commonly limited on at least one side by an abrupt descent, have flat or nearly smooth surfaces but are often dissected by deep valleys and surmounted by high hills or mountains, and have a large part of their total surface at or near the summit level. We use this category for table mountains; and for tablelands. The ADL type Mesas, collapsed here. NIMA GNS designators PLAT, PLTX, PLTU, MESA, MESU, TMSU, TMST.
subclass of: Land Region

Political Entity
type: Class
subclass of: Organization

Political Party
type: Class
comment: An organization to gain political power. Definition taken from WordNet 1.7
subclass of: Political Entity

Political Region
type: Class
comment: (ADL, Political Entity) We use this category for commonwealths; for dependent political entities; for freely associated states; for independent political entities; for oblasts; for political entities; and for semi-independent political entities. Sub-classes omitted: Countries, 4th order divisions. NIMA GNS class: A, Administrative Boundary Features.
subclass of: Location

Populated Place
type: Class
comment: (ADL FT) Places or areas with clustered or scattered buildings and a permanent human population. ... We use this category for agricultural colonies; for communes; for communities; for hamlets; for homesteads; for locales; for localities; for metropolitan areas; for populated localities; for ppl; for pueblos; for settlements; for suburbs; for villages; and with religious facilities for religious populated places. NIMA GNS designator PPL, PPL(x)
subclass of: Location

Postal Address
type: Class
subclass of: Address

Prime Minister
type: Class
subclass of: Executive

President
type: Class
subclass of: Leader

Profession
type: Class
subclass of: Social Abstraction

Project
type: Class
subclass of: Event

Province
type: Class
comment: (ADL FT: Countries, 1st Order Divisions) First-order divisions of a nation. [USGS Circ 1048] We use this category for cantons; for first-order administrative divisions; for provinces; for states; and for territories. NIMA GNS designator ADM1. Also corresponds to the FIPS 10-4 principal administrative division defined as "an administrative area directly subordinate to the pertinent governing authority " NIMA GNS designator ADM1.
subclass of: Political Region

Public Company
type: Class
comment: Company which is publicly traded on a Stock Exchange.
subclass of: Company

Published Material
type: Class
comment: A document which is published or intended for publishing
subclass of: Media Product
subclass of: Document

Publishing Company
type: Class
comment: An organization which main activity is mass publishing of information. Often, the publishers issue periodic and/or non-periodic documents on paper media. While on-line publishing is considered a typical activity for publishers, the streaming electronic media such as TV and Radio Stations are not.
subclass of: Media Company

Quarter
type: Class
comment: A specific quarter of a specific year, such as Q4 1999
subclass of: TimeInterval

Race Course
type: Class
subclass of: Sport Facility

Radio Station
type: Class
subclass of: Media Brand

Railroad Facility
type: Class
comment: (ADL FT: Railroad Features) We use this category for metro rail stations; for railroad junctions; for railroad sidings; for railroad spurs; for railroad stations; for railroad stops; for railroad switches; for railroad yards; for railways; for subway stations; for switches (railroad); and for tramways. NIMA GNS designator RJCT, RR, RRQ, RSD, RSGNL, RSTN, RSTNQ, RSTP, RSTPQ, RYD.
subclass of: Transport Facility

Railroad Tunnel
type: Class
comment: NIMA GNS designator RTNL.
subclass of: Railroad Facility
subclass of: Tunnel

Recreational Facility
type: Class
comment: (ADL FT) We use this category for access areas; for access sites; for boardwalks; for casinos; for clubs (recreational); for country clubs; for fairgrounds; for fishing areas; for fishing lodges; for fitness centers; for gun clubs; for hunt posts; for hunting lodges; for ice skating rinks; for playgrounds; for recreation sites; for resorts; for riding stables; for spas; for sportsman lodges; for stables; for yacht clubs; for youth centers; and for youth facilities. NIMA GNS designators - no direct equivalents.
subclass of: Facility

Reef
type: Class
comment: (ADL FT) Chains of rocks or coral at or near the surface of water. [USGS Circ 1048] We use this category for barrier reefs; and for fringing reefs. Collapsed ADL sub-class: Coral Reefs. NIMA GNS designator RF, RFSU, RFU, RFC.
subclass of: Land Region

Reference Location
type: Class
comment: (ADL FT) We use this category for astronomical stations; for beacons; for bench marks; for boundaries; for boundary markers; for buoys; for control points; for geodectic stations; for geographic centers; for landmarks (reference locations); for light houses; for light stations; for lighthouses; for markers; for milestones; for plaques; for poles (sphere); for triangulation stations; and for walls. NIMNA GNS designators LTHSE, BP, TRIG.
subclass of: Facility

Religious Location
type: Class
comment: Things like Monastery, Church
subclass of: Facility

Religious Organization
type: Class
comment: Organization which offers ideas and opinions about life. Just joking.
subclass of: Organization

Report
type: Class
subclass of: Document

Research Area
type: Class
comment: Specific research area, topic or field.
subclass of: Social Abstraction

Research Organization
type: Class
subclass of: Organization

Reserve
type: Class
comment: (ADL FT) Areas set aside for the preservation of fauna, flora, and their natural habitats. [Macmillan Encyc., 2001] We use this category for agricultural reserves; for conservation areas; for demonstration areas; for environmental areas; for forest reserves; for game management areas; for hunting reserves; for management areas (reserves); for natural areas; for nature reserves; for palm tree reserves; for preserves; for primitive areas; for protected areas; for reservations (nature sites); for road less areas; for sanctuaries (wildlife); for wildlife areas; for wildlife refuges; and for wildlife reserves. NIMA GNS designators RES, RESA, RESF, RESH, RESN, RESP, RESV, RESW.
subclass of: Facility

Reservoir
type: Class
comment: (ADL FT) Artificially impounded bodies of water. We use this category for covered reservoirs; and for intermittent reservoirs. (incl. dams) NIMA GNS designator RSV, RSVI.
subclass of: Hydrographic Structure
subclass of: Lake

Resource Collection
type: Class
comment: A collection is an aggregation of information resources. The term collection means that the resource is described as a group; its parts may be separately described and navigated. (DCMI type Collection)
subclass of: InformationResource

Ridge
type: Class
comment: (ADL FT) Elevations with a narrow, elongated crest which can be part of a hill or mountain. ... We use this category for aretes; for beach ridges; for cuestas; for eskers; for hogbacks; for icecap ridges; for rises (seafloor); and for spurs (physiographic). Omitted ADL sub-classes: Drumlin. NIMA GNS designators RDGB, RDGE, RDGG, RDGU, RISU, SPRU, SPUR.
subclass of: Mountain

River
type: Class
comment: (ADL FT) Natural freshwater surface streams of considerable volume and a permanent or seasonal flow, moving in a definite channel toward a sea, lake, or another river; any large streams, or ones larger than brooks or creeks, such as the trunk stream and larger branches of a drainage system. We use this category for rios. NIM GNS designators ... no direct equivalents!
subclass of: Stream

Roadway
type: Class
comment: (ADL FT) Open ways for passage of vehicles. [USGS Circ 1048] We use this category for caravan routes; for causeways; for drives; for highways; for intersections; for parkways; for road bends; for road cuts; for road junctions; for roads; for streets; and for traffic circles. NIMA GNS designators CSWY, CSWYQ, RD, RDA, RDB, RDCUT, RDJCT, RDST, RTE, STKR.
subclass of: Transport Facility

Satellite
type: Class
comment: An astronomic object orbiting around a planet or star. Definition partly derived from WordNet 1.7
subclass of: Astronomical Object

School
type: Class
subclass of: Educational Organization

Science
type: Class
comment: A well established, big research area
subclass of: Research Area

Sea
type: Class
comment: (ADL FT) Large bodies of salt water. NIMA GNS designator SEA
subclass of: Water Region

Season
type: Class
subclass of: Temporal Abstraction

Ship
type: Class
subclass of: Vehicle

Soccer Club
type: Class
comment: A soccer (football) team
subclass of: Sport Club

Social Abstraction
type: Class
comment: Any sort of general social phenomenon, such as particular sort of art or science
subclass of: Abstract

Song
type: Class
subclass of: Audio Recording

Spacecraft
type: Class
comment: [WN1.7] Space vehicle - a craft capable of traveling in outer space; technically a satellite around the sun.
subclass of: Vehicle

Sport
type: Class
comment: A specific type of sport game
subclass of: Social Abstraction

Sport Building
type: Class
subclass of: Building
subclass of: Sport Facility

Sport Club
type: Class
comment: A sports club, football club or F1 team. Those should be considered commercial although in many cases they are not run for profit.
subclass of: Company
subclass of: Sport Organization

Sport Event
type: Class
subclass of: Event

Sport Facility
type: Class
comment: (ADL FT) Fields, centers, or open areas maintained for the purpose of holding sporting events and activities. [USGS Circ 1048] We use this category for aquatic centers; for arenas; for athletic complexes; for athletic fields; for ball parks; for baseball fields; for dragways; for equestrian centers; for fields; for football fields; for golf clubs; for golf courses; for gymnasiums; for natatoriums; for physical education facilities; for pistol ranges (sport); for polo fields; for pools, swimming; for race tracks; for racecourses; for racetracks; for raceways; for rifle ranges; for rodeo grounds; for shooting ranges (sport); for skeet shooting ranges; for ski areas; for ski facilities; for ski trails; for speedways; for stadiums; for swim clubs; for swimming pools; for tennis clubs; and for tennis courts. NIMA GNS designators RECG, RECR, STDM, ATHF.
subclass of: Recreational Facility

Sport Game
type: Class
comment: as a soccer match
subclass of: Sport Event

Sport Organization
type: Class
comment: An organization (local, national or international) which main activity is related to one or more sports. Those could be clubs, as well, as all the sorts of federations.
subclass of: Organization

Sports Federation
type: Class
subclass of: Sport Organization

Spring
type: Class
comment: (ADL FT) Places where underground water flows naturally to the surface of the Earth. ... We use this category for mineral springs; and for sulfur springs. NIMA GNS designators SPNG, SPNS, SPNT.
subclass of: Stream

Stadium
type: Class
comment: A special sort of sport building, usually for open-air sports such as soccer.
subclass of: Sport Building

Star
type: Class
comment: An astronomic object of hot gases that radiates energy derived from thermonuclear reactions in the interior. Definition partly derived from WordNet 1.7
subclass of: Astronomical Object

Stock Exchange
type: Class
comment: Stock Exchange where public companies are traded, e. g. Nasdaq, NYSE, etc.
subclass of: Organization

Stream
type: Class
comment: (ADL FT) Linear bodies of water flowing on the Earth's surface. We use this category for anabranches; for brooks; for burns (hydrographic); for confluences; for creeks; for distributaries; for dry stream beds; for forks (physiographic features); for intermittent streams; for lost rivers; for meanders; for stream bends; for stream mouths; for tidal creeks; for tributaries; and for watercourses. NIMA GNS designators STM, STMA, STMB, STMC, STMD, STMH, STMI, STMIX, STMM, STMQ, STMS, STMSB, STMX
subclass of: Water Region

Street
type: Class
comment: The general notion for a roadway within a city or village, often, surrounded by buildings. We put here boulevards, streets, avenues, etc. NIMA GNS designator - missing.
subclass of: Roadway

TV Channel
type: Class
subclass of: Media Brand

TV Company
type: Class
subclass of: Media Company

Team
type: Class
comment: A group of people gathered for some task, say a project. Teams are usually not formally established and not meant to perform as a single agent for purposes outside the scope of their task. Teams may "live" within organizations, spread between multiple organizations, or be independent form any organization.
subclass of: Organization

Telecom
type: Class
comment: A telecommunications company
subclass of: Company

Telecom Facility
type: Class
comment: (ADL FT: Telecommunication Features) We use this category for antenna field sites; for communication centers; for radio stations; for television stations; and for transmission lines. NIMA GNS designators COMC, STNR, STNS.
subclass of: Facility

Temporal Abstraction
type: Class
comment: Any sort of abstraction used to refer to specific periods of time. Thus, the month of September is an instance of this class, while Sept 1989 is not (it is a specific TimeInterval, and thus not abstract)
subclass of: Abstract

Theatre Performance
type: Class
subclass of: Art Performance

Time Zone
type: Class
subclass of: Temporal Abstraction

Tournament
type: Class
subclass of: Sport Event

Tower
type: Class
comment: (ADL FT) Manmade structures, higher than their diameter, generally used for observation, storage, or electronic transmission. We use this category for carillons; for fire lookouts; and for pagodas. NIMA GNS designator TOWR.
subclass of: Building

Transport Facility
type: Class
comment: (ADL FT: Transportation Features) We use this category for air routes; for caravan routes; for corridors; for crossings; for depots; for ferries; for fords (crossings); for fuel depots; for gates (manmade); for halting places (transportation); for highway maintenance sites; for portages; for rest houses; for routes; for ship tracks; for stock routes; for terminals (transportation); and for transit facilities. Omitted sub-classes: Aqueducts, Cableways, Parking Sites. NIMA GNS designator - no direct equivalents.
subclass of: Facility

Tundra
type: Class
comment: (ADL FT) Treeless, level, or gently rolling plains characteristic of arctic or subarctic regions, having a permanently frozen subsoil, and usually supporting low growing vegetation such as lichens, mosses, and stunted shrubs. [USGS Circ 1048] We use this category for Arctic land. NIMA GNS designator TUND, LAND.
subclass of: Biogeographic Region

Tunnel
type: Class
comment: (ADL FT) Underground or underwater passages. [USGS Circ 1048] We use this category for canal tunnels; for railroad tunnels; and for road tunnels. NIMA GNS designator TNL, TNLC, TNLN, TNLRD, TNLS
subclass of: Transport Facility

University
type: Class
subclass of: Educational Organization
subclass of: Research Organization

Urban District
type: Class
comment: (ADL FT: Countries, 3rd order divisions) Minor civil units. [USGS Circ 1048] We use this category for barrios; for precincts; for third-order administrative divisions; and for townships. NIMA GNS designator ADM3.
subclass of: Political Region

Valley
type: Class
comment: (ADL FT) Low-lying land bordered by higher ground; especially elongate, relatively large gently sloping depressions of the Earth's surface, commonly situated between two mountains or between ranges of hills or mountains, and often containing a stream with an outlet. [Glossary of Geology, 4th ed.] We use this category for forks (physiographic features); for glens; for hanging valleys; for hollows; for median valleys; and for shelf valleys (seafloor). NIMA GNS designators VAL, VALG, VALU, VALS, VALX, VLSU, FRKU, FRSU, MDVU, SHVU.
subclass of: Land Region

Vehicle
type: Class
comment: Any sort of specific vehicle
subclass of: Object

Volcano
type: Class
comment: (ADL FT) Vents in the surface of the Earth through which magma and associated gases erupt; also, the forms or structures, usually conical, that are produced by the erupted material. NIMA GNS designator VLC.
subclass of: Mountain

Water Bank
type: Class
comment: (ADL FT: Banks) Sloping margins of, or the ground bordering, a stream, and serving to confine the water to the natural channel during the normal course of flow. [Glossary of Geology, 4th ed.] We use this category for stream banks. NIMA GNS designator BKSU, BNK, BNKR, BNKU, BNKX.
subclass of: Land Region

Water Region
type: Class
comment: (ADL FT: Hydrographic Features) For natural bodies of water. For constructed waterways, reservoirs, and such, use 'hydrographic structures'. We use this category for bodies of water; for eddies; for fluvial features; for marine features; for overfalls; for upwellings; for water bodies; for waterholes; and for whirlpools. Many of the ADL hydrographic features ignored. NIMA GNS class H.
subclass of: Location

Waterfalls
type: Class
comment: (ADL FT) Perpendicular or very steep falls of water in the course of a stream. ... We use this category for cascades; for cataracts; and for falls. NIMA GNS designator FLLS, FLLSX
subclass of: Land Region

Weapon Model or System
type: Class
comment: Such as Patriot, SU-28, and Kalashnikov.
subclass of: ProductModel

Web Page
type: Class
subclass of: Internet Address

Week
type: Class
comment: A specific week of a specific year (say the 41st of 2001)
subclass of: TimeInterval

Woman
type: Class
subclass of: Person

ISBN
type: DatatypeProperty
comment: The ISBN (International Standard Book Number) is a unique machine-readable identification number, which marks any book unmistakably.
domain: Book
sub property of: informationResourceIdentifier

ISSN
type: DatatypeProperty
comment: The ISSN (International Standard Serial Number) is an eight-digit number which identifies periodical publications as such, including electronic serials. More than one million ISSN numbers have so far been assigned.
domain: Periodical Publication
sub property of: informationResourceIdentifier

Date Published
type: DatatypeProperty
comment: Typically, associated with the creation or availability of the resource. Recommended best practice for encoding the date value is defined in a profile of ISO 8601 [W3CDTF] and includes (among others) dates of the form YYYY-MM-DD.
domain: Published Material
sub property of: hasDate

fiscalNetIncome
type: DatatypeProperty
comment: Net Income last year.
comment: fiscalNetIncome
domain: Commercial Organization

fiscalSales
type: DatatypeProperty
comment: Sales last year.
comment: fiscalSales
domain: Commercial Organization

has Code
type: DatatypeProperty
comment: Denotes that the Sector has the specified SIC code
domain: Industry Sector

has Unit
type: DatatypeProperty
domain: Currency

Stock Exchange Index
type: DatatypeProperty
comment: Name of the company on the Stock Exchange, where it is traded. At present, if a company is traded on two SEs with different indices, there is no way to encode which of them is applicable where.
domain: Public Company

Account Provider
type: ObjectProperty
comment: a relation between an account and the Agent (usually organization) providing and managing it
domain: Account
range: Agent

Active in Sector
type: ObjectProperty
transitive over: Subsector of
comment: Denotes that the organization is active within the industry sector
domain: Commercial Organization
range: Industry Sector

Compliant with Schema
type: ObjectProperty
comment: links a dataset with a schema it complies to
domain: InformationResource
range: Data Schema

has Address
type: ObjectProperty
comment: Relates address to an Agent. Will be used for URL, email and other addresses.
range: Address
sub property of: hasContactInfo

has Airport
type: ObjectProperty
domain: City
range: Airport

has Brother
type: ObjectProperty
range: Man
sub property of: hasSibling

has Capital
type: ObjectProperty
domain: Political Region
range: Capital

has Currency
type: ObjectProperty
domain: Country
range: Currency

has Daughter
type: ObjectProperty
range: Woman
sub property of: hasChild

has E-mail
type: ObjectProperty
range: E-mail
sub property of: has Internet Address

has Father
type: ObjectProperty
range: Man
sub property of: hasParent

has Fax
type: ObjectProperty
range: Phone Number
sub property of: hasContactInfo

has Government
type: ObjectProperty
domain: Country
range: Government Organization

has Husband
type: ObjectProperty
domain: Woman
range: Man
sub property of: hasSpouse

has Internet Address
type: ObjectProperty
range: Internet Address
sub property of: hasContactInfo

has Minister
type: ObjectProperty
domain: Ministry
range: Person
sub property of: hasEmployee

has Mobile Phone
type: ObjectProperty
sub property of: has Phone

has Mother
type: ObjectProperty
range: Woman
sub property of: hasParent

has Phone
type: ObjectProperty
range: Phone Number
sub property of: hasContactInfo

has Prime Minister
type: ObjectProperty
sub property of: has Minister

has Profession
type: ObjectProperty
domain: Person
range: Profession

has Publisher
type: ObjectProperty
comment: An entity responsible for making the resource available. Examples of Publisher include a person, an organization, or a service. (DC2003ISO)
domain: Published Material
range: Agent

has Shareholder
type: ObjectProperty
domain: Commercial Organization
sub property of: hasMember

has Sister
type: ObjectProperty
range: Woman
sub property of: hasSibling

has Son
type: ObjectProperty
range: Man
sub property of: hasChild

has Stationary Phone
type: ObjectProperty
sub property of: has Phone

has Web Page
type: ObjectProperty
range: Web Page
sub property of: has Internet Address

has Wife
type: ObjectProperty
domain: Man
range: Woman
sub property of: hasSpouse

Issue of
type: ObjectProperty
domain: Issue of Periodical
range: Periodical Publication

of Country
type: ObjectProperty
domain: Government Organization
range: Country
sub property of: locatedIn

Official Position in
type: ObjectProperty
comment: This property models the Person->hasPosition->Location.
domain: Official Position
range: Location

Published within
type: ObjectProperty
domain: Article
range: Resource Collection

Subsector of
type: ObjectProperty
type: TransitiveProperty
comment: The general part-of relation which takes place between a whole and each of its parts. It has number of specializations.
domain: Industry Sector
range: Industry Sector
sub property of: partOf

Traded on
type: ObjectProperty
comment: Relates the Public Company to the Stock Exchange where it is traded
domain: Public Company

acquirer
type: ObjectProperty
range: Organization
domain: Acquirement
sub property of: partOf

acquired
type: ObjectProperty
domain: Acquirement
range: Organization
sub property of: partOf